BDBM50415839 CHEMBL1095594
SMILES Cc1nc2ccc(CN(CC#N)c3ccc(s3)C(=O)N[C@@H](CCC(O)=O)C(O)=O)cc2c(=O)[nH]1
InChI Key InChIKey=FPTVCEGXPUIPTK-INIZCTEOSA-N
Data  1 IC50
  Tab Delimited (TSV)   2D SDfile   Computed 3D by Vconf -m prep SDfile
Find this compound or compounds like it in BindingDB:
Activity Spreadsheet -- Enzyme Inhibition Constant Data from BindingDB
Found 1 hit for monomerid = 50415839
TargetThymidylate synthase(Homo sapiens (Human))
Meerut Institute Of Engineering And Technology
Curated by ChEMBL
LigandPNGBDBM50415839(CHEMBL1095594)
Affinity DataIC50:  3.09E+3nM. Assay description: Inhibition of thymidylate synthase
In DepthDetails ArticlePubMed