BDBM504177 N-(2,2-Dimethyl-6-(4-((3- methylisoxazol-4- yl)methyl)piperazin-1-yl)-2,3- dihydrobenzofuran-5- yl)pyrazolo[1,5-a]pyrimidine-3- carboxamide hydrochloride::US11034698, Example 14
SMILES Cc1nocc1CN1CCN(CC1)c1cc2OC(C)(C)Cc2cc1NC(=O)c1cnn2cccnc12
InChI Key InChIKey=SYNLGUJRTCIPLX-UHFFFAOYSA-N
Data  1 KI
  Tab Delimited (TSV)   2D SDfile   Computed 3D by Vconf -m prep SDfile
Find this compound or compounds like it in BindingDB:
Activity Spreadsheet -- Enzyme Inhibition Constant Data from BindingDB
Found 1 hit for monomerid = 504177
TargetNuclear receptor ROR-gamma(Homo sapiens (Human))
Genentech
US Patent
LigandPNGBDBM504177(N-(2,2-Dimethyl-6-(4-((3- methylisoxazol-4- yl)met...)
Affinity DataKi:  5.20nM. Assay description: The IRAK4 reaction conditions were optimized using an IRAK1-derived peptide (sequence H-KKARFSRFAGSSPSQSSMVAR) to provide a linear reaction rate over...
Ligand InfoPC cidPC sid
In DepthDetails US Patent