BDBM50417973 CHEMBL1672053
SMILES CN(Cc1cc(cc(c1)C(F)(F)F)C(F)(F)F)C(=O)N1CC[C@@H](C[C@@H]1c1ccc(F)cc1C)N1CCN(CC1)C(C)=O
InChI Key InChIKey=XHZRREUKUVJSDC-AZGAKELHSA-N
Data  1 KI
  Tab Delimited (TSV)   2D SDfile   Computed 3D by Vconf -m prep SDfile
Find this compound or compounds like it in BindingDB:
Activity Spreadsheet -- Enzyme Inhibition Constant Data from BindingDB
Found 1 hit for monomerid = 50417973
TargetSubstance-P receptor(Homo sapiens (Human))
Glaxosmithkline
Curated by ChEMBL
LigandPNGBDBM50417973(CHEMBL1672053)
Affinity DataKi:  0.117nM. Assay description: Displacement of [3H]SP from human NK1 receptor expressed in CHO cells by liquid scintillation counting
In DepthDetails ArticlePubMed