BDBM50417982 CHEMBL1672058
SMILES C[C@@H](N(C)C(=O)N1CC[C@@H](C[C@@H]1c1ccc(F)cc1C)NC1CCC1)c1cc(cc(c1)C(F)(F)F)C(F)(F)F
InChI Key InChIKey=ZRNRBAIQIBQHNF-WSNNEZGNSA-N
Data  1 KI
  Tab Delimited (TSV)   2D SDfile   Computed 3D by Vconf -m prep SDfile
Find this compound or compounds like it in BindingDB:
Activity Spreadsheet -- Enzyme Inhibition Constant Data from BindingDB
Found 1 hit for monomerid = 50417982
TargetSubstance-P receptor(Homo sapiens (Human))
Glaxosmithkline
Curated by ChEMBL
LigandPNGBDBM50417982(CHEMBL1672058)
Affinity DataKi:  0.170nM. Assay description: Displacement of [3H]SP from human NK1 receptor expressed in CHO cells by liquid scintillation counting
In DepthDetails ArticlePubMed