BDBM50420430 CHEMBL2089349
SMILES O[C@@H]1[C@@H]2C[C@@H]2[C@H]([C@@H]1O)n1cnc2c(NCC(c3ccccc3)c3ccccc3)nc(nc12)C#Cc1ccc(F)c(F)c1
InChI Key InChIKey=NQMLXNUXIKIGKI-WCVDKECISA-N
Data  1 KI
  Tab Delimited (TSV)   2D SDfile   Computed 3D by Vconf -m prep SDfile
Find this compound or compounds like it in BindingDB:
Activity Spreadsheet -- Enzyme Inhibition Constant Data from BindingDB
Found 1 hit for monomerid = 50420430
TargetAdenosine receptor A3(Homo sapiens (Human))
TBA
Curated by ChEMBL
LigandPNGBDBM50420430(CHEMBL2089349)
Affinity DataKi:  340nM. Assay description: Displacement of [3H]I-AB-MECA from human recombinant adenosine A3 receptor expressed in CHO cells after 60 mins by liquid scintillation counting
In DepthDetails ArticlePubMed