BDBM50421278 CHEMBL2087654
SMILES CNS(=O)(=O)c1ccc(cc1)-c1[nH]c2ncnc(NC[C@@H]3CCCO3)c2c1-c1ccccc1
InChI Key InChIKey=IAAPQGNOFQITDM-SFHVURJKSA-N
Data  1 KI  1 IC50
  Tab Delimited (TSV)   2D SDfile   Computed 3D by Vconf -m prep SDfile
Find this compound or compounds like it in BindingDB:
Activity Spreadsheet -- Enzyme Inhibition Constant Data from BindingDB
Found 2 hits for monomerid = 50421278
TargetActivated CDC42 kinase 1(Homo sapiens (Human))
Amgen
Curated by ChEMBL
LigandPNGBDBM50421278(CHEMBL2087654)
Affinity DataKi:  2nM. Assay description: Inhibition of N-terminal His6-tagged ACK1 expressed in baculovirus infected Hi5 cells assessed as inhibition of autophosphorylation after 2 hrs by EL...
In DepthDetails ArticlePubMed
TargetActivated CDC42 kinase 1(Mus musculus)
Amgen
Curated by ChEMBL
LigandPNGBDBM50421278(CHEMBL2087654)
Affinity DataIC50:  40nM. Assay description: Inhibition of ACK1 in mouse C8 cells assessed as decrease in cell viability after 20 to 24 hrs
In DepthDetails ArticlePubMed