BDBM50421965 CHEMBL324864
SMILES NCCc1csc(N)n1
InChI Key InChIKey=AWGAMNRCCCIYLX-UHFFFAOYSA-N
Data  1 Kd
  Tab Delimited (TSV)   2D SDfile   Computed 3D by Vconf -m prep SDfile
Find this compound or compounds like it in BindingDB:
Activity Spreadsheet -- Enzyme Inhibition Constant Data from BindingDB
Found 1 hit for monomerid = 50421965
TargetHistamine H2 receptor(Cavia porcellus (domestic guinea pig))
Vrije Universiteit
Curated by ChEMBL
LigandPNGBDBM50421965(CHEMBL324864)
Affinity DataKd:  1.10E+5nM. Assay description: Compound is evaluated for histamine H2 receptor agonistic activity in guinea pig cerebral cortex using [3H]tiotidine as radioligand
In DepthDetails ArticlePubMed