BDBM50421998 CHEMBL2094076
SMILES CC[C@@H](C)Nc1ncnc2n(cnc12)[C@@H]1O[C@H](CO)[C@@H](O)[C@H]1O
InChI Key InChIKey=YJUIOYNLBQJUHH-BAYCTPFLSA-N
Data  1 KI
  Tab Delimited (TSV)   2D SDfile   Computed 3D by Vconf -m prep SDfile
Find this compound or compounds like it in BindingDB:
Activity Spreadsheet -- Enzyme Inhibition Constant Data from BindingDB
Found 1 hit for monomerid = 50421998
TargetAdenosine receptor A1(GUINEA PIG)
Kyowa Hakko Kogyo
Curated by ChEMBL
LigandPNGBDBM50421998(CHEMBL2094076)
Affinity DataKi:  1.30nM. Assay description: Inhibition of N6-[3H]cyclohexyladenosine binding to guinea pig forebrain membrane Adenosine A1 receptor
In DepthDetails ArticlePubMed