BDBM50422026 CHEMBL320412
SMILES CN(C)CCc1c[nH]c2ccc(CN3CC(C)(C)NS3(=O)=O)cc12
InChI Key InChIKey=BOFZPIYNCDADLB-UHFFFAOYSA-N
Data  2 IC50
  Tab Delimited (TSV)   2D SDfile   Computed 3D by Vconf -m prep SDfile
Find this compound or compounds like it in BindingDB:
Activity Spreadsheet -- Enzyme Inhibition Constant Data from BindingDB
Found 2 hits for monomerid = 50422026
Target5-hydroxytryptamine receptor 1D(Sus scrofa)
Merck Sharp & Dohme Research Laboratories
Curated by ChEMBL
LigandPNGBDBM50422026(CHEMBL320412)
Affinity DataIC50:  100nM. Assay description: Displacement of [3H]5-HT binding to 5-hydroxytryptamine 1D receptor from pig caudate membrane
In DepthDetails ArticlePubMed
Target5-hydroxytryptamine receptor 5A(Homo sapiens (Human))
Merck Sharp & Dohme Research Laboratories
Curated by ChEMBL
LigandPNGBDBM50422026(CHEMBL320412)
Affinity DataIC50:  251nM. Assay description: Displacement of [3H]8-OH-DPAT binding to 5-hydroxytryptamine 1A receptor from pig cortex
In DepthDetails ArticlePubMed