BDBM50422863 CHEMBL212356
SMILES Fc1ccccc1S(=O)(=O)N1CCCCC(=N1)c1ccc(cc1)C#N
InChI Key InChIKey=KQQWVJMECBOLPR-UHFFFAOYSA-N
Data  1 IC50
  Tab Delimited (TSV)   2D SDfile   Computed 3D by Vconf -m prep SDfile
Find this compound or compounds like it in BindingDB:
Activity Spreadsheet -- Enzyme Inhibition Constant Data from BindingDB
Found 1 hit for monomerid = 50422863
TargetProgesterone receptor(Homo sapiens (Human))
Glaxosmithkline
Curated by ChEMBL
LigandPNGBDBM50422863(CHEMBL212356)
Affinity DataIC50:  398nM. Assay description: Antagonist activity against PR beta-mediated transactivation of MMTV luciferase reporter gene in BacMam transduced progesterone-stimulated CV1 cells
In DepthDetails ArticlePubMed