BDBM50422864 CHEMBL212466
SMILES [O-][N+](=O)c1ccc(cc1)C1=NN(CCCC1)S(=O)(=O)c1ccc(OC(F)(F)F)cc1
InChI Key InChIKey=KGCQIOUZEREWDG-UHFFFAOYSA-N
Data  1 IC50
  Tab Delimited (TSV)   2D SDfile   Computed 3D by Vconf -m prep SDfile
Find this compound or compounds like it in BindingDB:
Activity Spreadsheet -- Enzyme Inhibition Constant Data from BindingDB
Found 1 hit for monomerid = 50422864
TargetProgesterone receptor(Homo sapiens (Human))
Glaxosmithkline
Curated by ChEMBL
LigandPNGBDBM50422864(CHEMBL212466)
Affinity DataIC50:  158nM. Assay description: Antagonist activity against PR beta-mediated transactivation of MMTV luciferase reporter gene in BacMam transduced progesterone-stimulated CV1 cells
In DepthDetails ArticlePubMed