BDBM50422875 CHEMBL213684
SMILES CN(c1ccc2c(C)c(C)c(=O)oc2c1)S(=O)(=O)c1ccc(C)cc1
InChI Key InChIKey=ACYMPVHSUJKNNR-UHFFFAOYSA-N
Data  1 IC50
  Tab Delimited (TSV)   2D SDfile   Computed 3D by Vconf -m prep SDfile
Find this compound or compounds like it in BindingDB:
Activity Spreadsheet -- Enzyme Inhibition Constant Data from BindingDB
Found 1 hit for monomerid = 50422875
TargetAmine oxidase [flavin-containing] A(Rattus norvegicus (rat))
Universit£
Curated by ChEMBL
LigandPNGBDBM50422875(CHEMBL213684)
Affinity DataIC50:  4.57E+3nM. Assay description: Inhibition of Sprague-Dawley rat brain mitochondria MAOA by continuous spectrophotometric assay
In DepthDetails ArticlePubMed