BDBM50422970 CHEMBL388510
SMILES Cc1ccc(-c2cc(C)ccc2OCc2ccc(F)cc2)n1-c1cc(N)c(C)c(c1)C(O)=O
InChI Key InChIKey=BTXOWLVLHSEQDY-UHFFFAOYSA-N
Data  1 IC50
  Tab Delimited (TSV)   2D SDfile   Computed 3D by Vconf -m prep SDfile
Find this compound or compounds like it in BindingDB:
Activity Spreadsheet -- Enzyme Inhibition Constant Data from BindingDB
Found 1 hit for monomerid = 50422970
TargetProstaglandin E2 receptor EP1 subtype(Homo sapiens (Human))
Glaxosmithkline
Curated by ChEMBL
LigandPNGBDBM50422970(CHEMBL388510)
Affinity DataIC50:  16nM. Assay description: Displacement of [3H]PGE2 from human recombinant EP1 receptor expressed in CHOK1 cell membrane
In DepthDetails ArticlePubMed