BDBM50425171 CHEMBL2313568
SMILES CC(=O)NC1CCN(Cc2coc3cc(Oc4nc5ccccc5s4)ccc23)CC1
InChI Key InChIKey=RDDQQKHXDCUMRC-UHFFFAOYSA-N
Data  2 IC50
  Tab Delimited (TSV)   2D SDfile   Computed 3D by Vconf -m prep SDfile
Find this compound or compounds like it in BindingDB:
Activity Spreadsheet -- Enzyme Inhibition Constant Data from BindingDB
Found 2 hits for monomerid = 50425171
TargetLeukotriene A-4 hydrolase(Mus musculus)
Janssen Research And Development
Curated by ChEMBL
LigandPNGBDBM50425171(CHEMBL2313568)
Affinity DataIC50:  100nM. Assay description: Inhibition of LTA4H in CD1 mouse whole blood assessed as decrease in calcium ionophore-stimulated LTB4 production incubated for 15 mins prior to calc...
In DepthDetails ArticlePubMed
TargetLeukotriene A-4 hydrolase(Homo sapiens (Human))
Janssen Research And Development
Curated by ChEMBL
LigandPNGBDBM50425171(CHEMBL2313568)
Affinity DataIC50:  26nM. Assay description: Inhibition of recombinant human LTA4H expressed in Sf9 cells using LTA4 as substrate incubated for 10 mins prior to substrate addition measured after...
In DepthDetails ArticlePubMed