BDBM50425258 CHEMBL2315181
SMILES CNC(=O)c1cnc(s1)N1CCC2(CC1)CCN(Cc1cccc(c1)C(F)(F)F)c1ccccc1O2
InChI Key InChIKey=OUNPQMQMRCEGEN-UHFFFAOYSA-N
Data  1 IC50
  Tab Delimited (TSV)   2D SDfile   Computed 3D by Vconf -m prep SDfile
Find this compound or compounds like it in BindingDB:
Activity Spreadsheet -- Enzyme Inhibition Constant Data from BindingDB
Found 1 hit for monomerid = 50425258
TargetAcyl-CoA desaturase 1(Rattus norvegicus (Rat))
Merck Research Laboratories
Curated by ChEMBL
LigandPNGBDBM50425258(CHEMBL2315181)
Affinity DataIC50:  3nM. Assay description: Inhibition of rat SCD1 by rat microsomal assay
In DepthDetails ArticlePubMed