BDBM50426171 CHEMBL483842::Ircinin 2
SMILES C[C@H](CC\C=C(\C)CCCc1coc(Cc2ccoc2)c1)C=C1OC(=O)C(C)C1=O
InChI Key InChIKey=LNDMURLDCJJLHT-RVZURWQWSA-N
Data  2 IC50
  Tab Delimited (TSV)   2D SDfile   Computed 3D by Vconf -m prep SDfile
Find this compound or compounds like it in BindingDB:
Activity Spreadsheet -- Enzyme Inhibition Constant Data from BindingDB
Found 2 hits for monomerid = 50426171
TargetGlycogen synthase kinase-3 beta(Homo sapiens (Human))
Universitat De Barcelona
Curated by ChEMBL
LigandPNGBDBM50426171(CHEMBL483842 | Ircinin 2)
Affinity DataIC50:  2.34E+3nM. Assay description: Inhibition of human recombinant GSK-3beta using GS2 peptide as substrate and [gamma33P]-ATP after 30 mins by scintillation counting
In DepthDetails ArticlePubMed
TargetGlycogen synthase kinase-3 beta(Homo sapiens (Human))
Universitat De Barcelona
Curated by ChEMBL
LigandPNGBDBM50426171(CHEMBL483842 | Ircinin 2)
Affinity DataIC50:  2.34E+3nM. Assay description: Inhibition of human recombinant GSK-3beta using GS2 peptide as substrate and [gamma33P]-ATP after 30 mins by scintillation counting
In DepthDetails ArticlePubMed