BDBM50426695 CHEMBL2326521
SMILES FC(F)(F)c1cccc(c1)-c1cn(nn1)-c1ccc2OS(=O)(=O)C=Cc2c1
InChI Key InChIKey=KWCHTJIVCWOEQW-UHFFFAOYSA-N
Data  4 KI
  Tab Delimited (TSV)   2D SDfile   Computed 3D by Vconf -m prep SDfile
Find this compound or compounds like it in BindingDB:
Activity Spreadsheet -- Enzyme Inhibition Constant Data from BindingDB
Found 4 hits for monomerid = 50426695
TargetCarbonic anhydrase 12(Homo sapiens (Human))
Latvian Association Of Human Genetics
Curated by ChEMBL
LigandPNGBDBM50426695(CHEMBL2326521)
Affinity DataKi:  13nM. Assay description: Inhibition of human recombinant transmembrane CA12 catalytic domain after 6 hrs by stopped-flow CO2 hydration method
In DepthDetails ArticlePubMed
TargetCarbonic anhydrase 9(Homo sapiens (Human))
Latvian Association Of Human Genetics
Curated by ChEMBL
LigandPNGBDBM50426695(CHEMBL2326521)
Affinity DataKi:  48nM. Assay description: Inhibition of human recombinant transmembrane CA9 catalytic domain after 6 hrs by stopped-flow CO2 hydration method
In DepthDetails ArticlePubMed
TargetCarbonic anhydrase 1(Homo sapiens (Human))
Latvian Association Of Human Genetics
Curated by ChEMBL
LigandPNGBDBM50426695(CHEMBL2326521)
Affinity DataKi:  6.71E+3nM. Assay description: Inhibition of full length human recombinant CA1 cytosolic isoform after 6 hrs by stopped-flow CO2 hydration method
In DepthDetails ArticlePubMed
TargetCarbonic anhydrase 2(Homo sapiens (Human))
Latvian Association Of Human Genetics
Curated by ChEMBL
LigandPNGBDBM50426695(CHEMBL2326521)
Affinity DataKi:  7.72E+3nM. Assay description: Inhibition of full length human recombinant CA2 cytosolic isoform after 6 hrs by stopped-flow CO2 hydration method
In DepthDetails ArticlePubMed