BDBM50427039 CHEMBL2322208
SMILES Cc1ccc(cc1)S(=O)(=O)N[C@H]1CNC[C@H](C1)C(=O)NCC1c2ccccc2Oc2ccccc12
InChI Key InChIKey=SOEKUZSTSXYGKH-VQTJNVASSA-N
Data  1 IC50
PDB links: 1 PDB ID matches this monomer.
  Tab Delimited (TSV)   2D SDfile   Computed 3D by Vconf -m prep SDfile
Find this compound or compounds like it in BindingDB:
Activity Spreadsheet -- Enzyme Inhibition Constant Data from BindingDB
Found 1 hit for monomerid = 50427039
TargetRenin(Homo sapiens (Human))
Novartis Pharma
Curated by ChEMBL
LigandPNGBDBM50427039(CHEMBL2322208)
Affinity DataIC50:  90nM. Assay description: Inhibition of human plasma renin