BDBM50427713 CHEMBL2324209
SMILES NC(N)=NCCC[C@H](NC(=O)[C@H](CC(=O)NO)Cc1ccc2ccccc2c1)C(=O)N[C@@H](Cc1c[nH]c2ccccc12)C(=O)N[C@@H](CCC(O)=O)C(N)=O
InChI Key InChIKey=BZKOMDWHRRVIDX-DFZCOPKLSA-N
Data  1 KI
  Tab Delimited (TSV)   2D SDfile   Computed 3D by Vconf -m prep SDfile
Find this compound or compounds like it in BindingDB:
Activity Spreadsheet -- Enzyme Inhibition Constant Data from BindingDB
Found 1 hit for monomerid = 50427713
TargetInsulin-degrading enzyme(Homo sapiens (Human))
Mayo Clinic
Curated by ChEMBL
LigandPNGBDBM50427713(CHEMBL2324209)
Affinity DataKi:  73nM. Assay description: Inhibition of human recombinant IDE-mediated FRET1 degradation
In DepthDetails ArticlePubMed