BDBM50427793 CHEMBL2325192
SMILES FC(F)(CNC(=O)Nc1ccc2nnsc2c1)c1ccccc1
InChI Key InChIKey=QEUAYHHEOAQERP-UHFFFAOYSA-N
Data  1 IC50
  Tab Delimited (TSV)   2D SDfile   Computed 3D by Vconf -m prep SDfile
Find this compound or compounds like it in BindingDB:
Activity Spreadsheet -- Enzyme Inhibition Constant Data from BindingDB
Found 1 hit for monomerid = 50427793
TargetProtein arginine N-methyltransferase 3 [N508S](Homo sapiens (Human))
University Of North Carolina At Chapel Hill
Curated by ChEMBL
LigandPNGBDBM50427793(CHEMBL2325192)
Affinity DataIC50:  5.00E+3nM. Assay description: Inhibition of PRMT3 (unknown origin) using histone H4 (1 to 24) as substrate after 1 hr by scintillation proximity assay in presence of [3H]-S-adenos...
In DepthDetails ArticlePubMed