BDBM50428391 CHEMBL448695::Ethyl 3,5-Dihydroxybenzoate
SMILES CCOC(=O)c1cc(O)cc(O)c1
InChI Key InChIKey=APHYVLPIZUVDTK-UHFFFAOYSA-N
Data  6 KI
PDB links: 1 PDB ID matches this monomer.
  Tab Delimited (TSV)   2D SDfile   Computed 3D by Vconf -m prep SDfile
Find this compound or compounds like it in BindingDB:
Activity Spreadsheet -- Enzyme Inhibition Constant Data from BindingDB
Found 6 hits for monomerid = 50428391
TargetCarbonic anhydrase 2(Homo sapiens (Human))
Universit£
Curated by ChEMBL
LigandPNGBDBM50428391(CHEMBL448695 | Ethyl 3,5-Dihydroxybenzoate)
Affinity DataKi:  660nM. Assay description: Inhibition of human carbonic anhydrase 2 preincubated for 15 mins by CO2 hydration stopped-flow assay
In DepthDetails ArticlePubMed
TargetCarbonic anhydrase 1(Homo sapiens (Human))
Universit£
Curated by ChEMBL
LigandPNGBDBM50428391(CHEMBL448695 | Ethyl 3,5-Dihydroxybenzoate)
Affinity DataKi:  690nM. Assay description: Inhibition of human carbonic anhydrase 1 preincubated for 15 mins by CO2 hydration stopped-flow assay
In DepthDetails ArticlePubMed
TargetCarbonic anhydrase 14(Homo sapiens (Human))
Universit£
Curated by ChEMBL
LigandPNGBDBM50428391(CHEMBL448695 | Ethyl 3,5-Dihydroxybenzoate)
Affinity DataKi:  830nM. Assay description: Inhibition of human carbonic anhydrase 14 preincubated for 15 mins by CO2 hydration stopped-flow assay
In DepthDetails ArticlePubMed
TargetCarbonic anhydrase 12(Homo sapiens (Human))
Universit£
Curated by ChEMBL
LigandPNGBDBM50428391(CHEMBL448695 | Ethyl 3,5-Dihydroxybenzoate)
Affinity DataKi:  850nM. Assay description: Inhibition of human carbonic anhydrase 12 preincubated for 15 mins by CO2 hydration stopped-flow assay
In DepthDetails ArticlePubMed
TargetCarbonic anhydrase 7(Homo sapiens (Human))
Universit£
Curated by ChEMBL
LigandPNGBDBM50428391(CHEMBL448695 | Ethyl 3,5-Dihydroxybenzoate)
Affinity DataKi:  900nM. Assay description: Inhibition of human carbonic anhydrase 7 preincubated for 15 mins by CO2 hydration stopped-flow assay
In DepthDetails ArticlePubMed
TargetCarbonic anhydrase 9(Homo sapiens (Human))
Universit£
Curated by ChEMBL
LigandPNGBDBM50428391(CHEMBL448695 | Ethyl 3,5-Dihydroxybenzoate)
Affinity DataKi:  910nM. Assay description: Inhibition of human carbonic anhydrase 9 preincubated for 15 mins by CO2 hydration stopped-flow assay
In DepthDetails ArticlePubMed