BDBM50428726 CHEMBL2333150
SMILES [#6]-[#8]-c1ccc(-[#8]-c2ccc3\[#6](=[#6](/C#N)C#N)-[#6](=O)-c4cccc2c34)cc1
InChI Key InChIKey=GVKROZXKOSQFDA-UHFFFAOYSA-N
Data  1 Kd
  Tab Delimited (TSV)   2D SDfile   Computed 3D by Vconf -m prep SDfile
Find this compound or compounds like it in BindingDB:
Activity Spreadsheet -- Enzyme Inhibition Constant Data from BindingDB
Found 1 hit for monomerid = 50428726
TargetInduced myeloid leukemia cell differentiation protein Mcl-1(Homo sapiens (Human))
Dalian University Of Technology
Curated by ChEMBL
LigandPNGBDBM50428726(CHEMBL2333150)
Affinity DataKd:  4.93E+3nM. Assay description: Binding affinity to his-tagged Mcl-1 (unknown origin) expressed in Escherichia coli BL21 (DE3) cells by ITC analysis
In DepthDetails ArticlePubMed