BDBM50428986 CHEMBL489692
SMILES O=C(Cc1ccccc1)Nc1ccccc1-c1cn2c(CN3CCNCC3)csc2n1
InChI Key InChIKey=YOUWCQRHYWCNRK-UHFFFAOYSA-N
Data  1 EC50
  Tab Delimited (TSV)   2D SDfile   Computed 3D by Vconf -m prep SDfile
Find this compound or compounds like it in BindingDB:
Activity Spreadsheet -- Enzyme Inhibition Constant Data from BindingDB
Found 1 hit for monomerid = 50428986
TargetNAD-dependent protein deacetylase sirtuin-1(Homo sapiens (Human))
Chinese Academy Of Sciences
Curated by ChEMBL
LigandPNGBDBM50428986(CHEMBL489692)
Affinity DataEC50:  1.40E+4nM. Assay description: Activation of N-terminal His6-tagged SIRT1 (156 to 664 amino acid residues) (unknown origin) expressed in Escherichia coli BL21(DE3) using ac-RHKKac-...
In DepthDetails ArticlePubMed