BDBM50428998 CHEMBL2333655
SMILES Oc1c(Br)cc(\C=N\NC(=O)c2ccc(cc2)-c2cccnc2)c(O)c1Br
InChI Key InChIKey=AJNNBLCBRLEXNQ-AUEPDCJTSA-N
Data  1 EC50
  Tab Delimited (TSV)   2D SDfile   Computed 3D by Vconf -m prep SDfile
Find this compound or compounds like it in BindingDB:
Activity Spreadsheet -- Enzyme Inhibition Constant Data from BindingDB
Found 1 hit for monomerid = 50428998
TargetNAD-dependent protein deacetylase sirtuin-1(Homo sapiens (Human))
Chinese Academy Of Sciences
Curated by ChEMBL
LigandPNGBDBM50428998(CHEMBL2333655)
Affinity DataEC50:  2.00E+3nM. Assay description: Activation of N-terminal His6-tagged SIRT1 (156 to 664 amino acid residues) (unknown origin) expressed in Escherichia coli BL21(DE3) using ac-RHKKac-...
In DepthDetails ArticlePubMed