BDBM50429016 CHEMBL2334078
SMILES CC1CCCN(C1)c1nc(c(o1)C(=O)Nc1ccc(nc1)N1CCC(COc2cccc(c2)C(O)=O)CC1)C(F)(F)F
InChI Key InChIKey=UGBQERWGDVPIIU-UHFFFAOYSA-N
Data  1 IC50
  Tab Delimited (TSV)   2D SDfile   Computed 3D by Vconf -m prep SDfile
Find this compound or compounds like it in BindingDB:
Activity Spreadsheet -- Enzyme Inhibition Constant Data from BindingDB
Found 1 hit for monomerid = 50429016
TargetDiacylglycerol O-acyltransferase 1(Homo sapiens (Human))
Merck Research Laboratories
Curated by ChEMBL
LigandPNGBDBM50429016(CHEMBL2334078)
Affinity DataIC50:  79nM. Assay description: Inhibition of human DGAT1 expressed in Sf9 cells using 1,2-dioleoyl-sn-glycerol and [14C]-palmitoyl-Co A substrates incubated for 2 hrs by scintillat...
In DepthDetails ArticlePubMed