BDBM50429944 CHEMBL2331584
SMILES Cc1ccc(cc1)-c1cc(nn1-c1ccccc1)-c1ccccc1OCCCCC(O)=O
InChI Key InChIKey=ICCHTYMOWLJBJR-UHFFFAOYSA-N
Data  2 IC50
  Tab Delimited (TSV)   2D SDfile   Computed 3D by Vconf -m prep SDfile
Find this compound or compounds like it in BindingDB:
Activity Spreadsheet -- Enzyme Inhibition Constant Data from BindingDB
Found 2 hits for monomerid = 50429944
TargetFatty acid-binding protein, heart(Homo sapiens (Human))
Okayama University 1-1-1
Curated by ChEMBL
LigandPNGBDBM50429944(CHEMBL2331584)
Affinity DataIC50: >1.00E+7nM. Assay description: Inhibition of human FABP3 by 8-anilino-1-naphthalenesulfonic acid based fluorescence displacement assay
In DepthDetails ArticlePubMed
TargetFatty acid-binding protein, adipocyte(Homo sapiens (Human))
Okayama University 1-1-1
Curated by ChEMBL
LigandPNGBDBM50429944(CHEMBL2331584)
Affinity DataIC50:  2.59E+5nM. Assay description: Inhibition of human FABP4 by 8-anilino-1-naphthalenesulfonic acid based fluorescence displacement assay
In DepthDetails ArticlePubMed