BDBM50429950 CHEMBL2334246
SMILES OC(=O)CCCOc1ccccc1-c1cc(-c2ccc(Cl)cc2)n(n1)-c1ccccc1
InChI Key InChIKey=CPUUEDVSQQUHJT-UHFFFAOYSA-N
Data  2 IC50
  Tab Delimited (TSV)   2D SDfile   Computed 3D by Vconf -m prep SDfile
Find this compound or compounds like it in BindingDB:
Activity Spreadsheet -- Enzyme Inhibition Constant Data from BindingDB
Found 2 hits for monomerid = 50429950
TargetFatty acid-binding protein, heart(Homo sapiens (Human))
Okayama University 1-1-1
Curated by ChEMBL
LigandPNGBDBM50429950(CHEMBL2334246)
Affinity DataIC50:  2.10E+4nM. Assay description: Inhibition of human FABP3 by 8-anilino-1-naphthalenesulfonic acid based fluorescence displacement assay
In DepthDetails ArticlePubMed
TargetFatty acid-binding protein, adipocyte(Homo sapiens (Human))
Okayama University 1-1-1
Curated by ChEMBL
LigandPNGBDBM50429950(CHEMBL2334246)
Affinity DataIC50:  6.13E+3nM. Assay description: Inhibition of human FABP4 by 8-anilino-1-naphthalenesulfonic acid based fluorescence displacement assay
In DepthDetails ArticlePubMed