BDBM50431088 CHEMBL287899::Pyridine-2,3-Diol
SMILES Oc1ccc[nH]c1=O
InChI Key InChIKey=GGOZGYRTNQBSSA-UHFFFAOYSA-N
Data  1 IC50
  Tab Delimited (TSV)   2D SDfile   Computed 3D by Vconf -m prep SDfile
Find this compound or compounds like it in BindingDB:
Activity Spreadsheet -- Enzyme Inhibition Constant Data from BindingDB
Found 1 hit for monomerid = 50431088
TargetD-amino-acid oxidase(Homo sapiens (Human))
Astellas Pharma
Curated by ChEMBL
LigandPNGBDBM50431088(CHEMBL287899 | Pyridine-2,3-Diol)
Affinity DataIC50:  1.15E+3nM. Assay description: Inhibition of human recombinant DAAO after 30 mins by plate reader analysis
In DepthDetails ArticlePubMed