BDBM504330 US11040968, Example 012::WX012
SMILES FCCOc1cc(F)c(cc1-n1cnc(c1)C1CC1)C(=O)Nc1cccc(n1)-c1nnc2CCCCn12
InChI Key InChIKey=MOWQYQVEWMNHDZ-UHFFFAOYSA-N
Data  1 IC50
  Tab Delimited (TSV)   2D SDfile   Computed 3D by Vconf -m prep SDfile
Find this compound or compounds like it in BindingDB:
Activity Spreadsheet -- Enzyme Inhibition Constant Data from BindingDB
Found 1 hit for monomerid = 504330
TargetMitogen-activated protein kinase kinase kinase 5(Homo sapiens (Human))
TBA
US Patent
LigandPNGBDBM504330(US11040968, Example 012 | WX012)
Affinity DataIC50:  7.04nM. Assay description: Primary reaction buffer solution: 20 mM Hepes (pH 7.5), 10 mM MgCl2, 1 mM EGTA, 0.02% Brij35, 0.02 mg/ml BSA, 0.1 mM Na3VO4, 2 mM DTT, 1% DMSOTreatme...
Ligand InfoPC cidPC sid
In DepthDetails US Patent