BDBM50433237 CHEMBL2375971
SMILES COc1ccc(cc1Nc1nccc(n1)-c1cccnc1)C(=O)Nc1ccc(OCCCN(C)C)cc1
InChI Key InChIKey=AXCUTSXYMWKWEA-UHFFFAOYSA-N
Data  1 IC50
  Tab Delimited (TSV)   2D SDfile   Computed 3D by Vconf -m prep SDfile
Find this compound or compounds like it in BindingDB:
Activity Spreadsheet -- Enzyme Inhibition Constant Data from BindingDB
Found 1 hit for monomerid = 50433237
TargetBreakpoint cluster region protein/Tyrosine-protein kinase ABL1(Homo sapiens (Human))
Xi'An Jiaotong University
Curated by ChEMBL
LigandPNGBDBM50433237(CHEMBL2375971)
Affinity DataIC50:  0.520nM. Assay description: Inhibition of Bcr-Abl kinase (unknown origin) after 30 mins by HTRF assay
In DepthDetails ArticlePubMed