BDBM50433808 CHEMBL2382335
SMILES CN(c1cnc2nc(N)nc(N)c2c1)c1cc(F)ccc1F
InChI Key InChIKey=WXYWNFGIXCPAJG-UHFFFAOYSA-N
Data  1 IC50
  Tab Delimited (TSV)   2D SDfile   Computed 3D by Vconf -m prep SDfile
Find this compound or compounds like it in BindingDB:
Activity Spreadsheet -- Enzyme Inhibition Constant Data from BindingDB
Found 1 hit for monomerid = 50433808
TargetDihydrofolate reductase(Homo sapiens (Human))
Duquesne University
Curated by ChEMBL
LigandPNGBDBM50433808(CHEMBL2382335)
Affinity DataIC50:  46nM. Assay description: Inhibition of human recombinant DHFR
In DepthDetails ArticlePubMed