BDBM50433812 CHEMBL2382331
SMILES CN(c1ccc(C)cc1)c1cnc2nc(N)nc(N)c2c1
InChI Key InChIKey=BBPMPWKCKBBSCO-UHFFFAOYSA-N
Data  1 IC50
  Tab Delimited (TSV)   2D SDfile   Computed 3D by Vconf -m prep SDfile
Find this compound or compounds like it in BindingDB:
Activity Spreadsheet -- Enzyme Inhibition Constant Data from BindingDB
Found 1 hit for monomerid = 50433812
TargetDihydrofolate reductase(Homo sapiens (Human))
Duquesne University
Curated by ChEMBL
LigandPNGBDBM50433812(CHEMBL2382331)
Affinity DataIC50:  32nM. Assay description: Inhibition of human recombinant DHFR
In DepthDetails ArticlePubMed