BDBM50433821 CHEMBL2382322
SMILES Nc1nc(N)c2cc(Nc3ccc(cc3)[N+]([O-])=O)cnc2n1
InChI Key InChIKey=LNMAKCSDDGSEEK-UHFFFAOYSA-N
Data  1 IC50
  Tab Delimited (TSV)   2D SDfile   Computed 3D by Vconf -m prep SDfile
Find this compound or compounds like it in BindingDB:
Activity Spreadsheet -- Enzyme Inhibition Constant Data from BindingDB
Found 1 hit for monomerid = 50433821
TargetDihydrofolate reductase(Homo sapiens (Human))
Duquesne University
Curated by ChEMBL
LigandPNGBDBM50433821(CHEMBL2382322)
Affinity DataIC50:  7.20E+3nM. Assay description: Inhibition of human recombinant DHFR
In DepthDetails ArticlePubMed