BDBM50433828 CHEMBL2382315
SMILES COc1ccc(Nc2cnc3nc(N)nc(N)c3c2)cc1
InChI Key InChIKey=OVWODHJGJGNRMS-UHFFFAOYSA-N
Data  2 IC50
  Tab Delimited (TSV)   2D SDfile   Computed 3D by Vconf -m prep SDfile
Find this compound or compounds like it in BindingDB:
Activity Spreadsheet -- Enzyme Inhibition Constant Data from BindingDB
Found 2 hits for monomerid = 50433828
TargetDihydrofolate reductase(Homo sapiens (Human))
Duquesne University
Curated by ChEMBL
LigandPNGBDBM50433828(CHEMBL2382315)
Affinity DataIC50:  3.65E+3nM. Assay description: Inhibition of recombinant human DHFR assessed as reduction in consumption of NADPH using 18 uM DHFA as substrate
In DepthDetails ArticlePubMed
TargetDihydrofolate reductase(Homo sapiens (Human))
Duquesne University
Curated by ChEMBL
LigandPNGBDBM50433828(CHEMBL2382315)
Affinity DataIC50:  3.65E+3nM. Assay description: Inhibition of human recombinant DHFR
In DepthDetails ArticlePubMed