BDBM504357 US11040970, Compound 5-12
SMILES COc1cc2C3CN(C)[C@H](CC(C)C)CN3CCc2cc1OCCC#N
InChI Key InChIKey=AAAYLWOLBMQMBA-DUSLRRAJSA-N
Data  1 KI
  Tab Delimited (TSV)   2D SDfile   Computed 3D by Vconf -m prep SDfile
Find this compound or compounds like it in BindingDB:
Activity Spreadsheet -- Enzyme Inhibition Constant Data from BindingDB
Found 1 hit for monomerid = 504357
TargetSynaptic vesicular amine transporter(Homo sapiens (Human))
Neurocrine Biosciences
US Patent
LigandPNGBDBM504357(US11040970, Compound 5-12)
Affinity DataKi:  260nM. Assay description: In a total volume of 0.15 mL in low-binding 96-well plates (Corning #3605), twelve concentrations of test compound were competed against 10 nM 3H-dih...
Ligand InfoPC cidPC sid
In DepthDetails US Patent