BDBM50436163 CHEMBL1231573
SMILES Nc1nc2n(cnc2c(=O)[nH]1)[C@@H]1O[C@@H]2CO[P@@](O)(=O)O[C@@H]3[C@@H](CO[P@@](O)(=O)O[C@H]2[C@H]1O)O[C@H]([C@@H]3O)n1cnc2c1nc(N)[nH]c2=O
InChI Key InChIKey=PKFDLKSEZWEFGL-MHARETSRSA-N
Data  1 IC50  2 Kd  6 EC50
PDB links: 116 PDB IDs match this monomer.
  Tab Delimited (TSV)   2D SDfile   Computed 3D by Vconf -m prep SDfile
Find this compound or compounds like it in BindingDB:
Activity Spreadsheet -- Enzyme Inhibition Constant Data from BindingDB
Found 9 hits for monomerid = 50436163
TargetRocR(Pseudomonas aeruginosa (strain ATCC 15692 / PAO1 /...)
University Of Maryland
Curated by ChEMBL
LigandPNGBDBM50436163(CHEMBL1231573)
Affinity DataIC50:  20nM. Assay description: Competitive binding affinity to Pseudomonas aeruginosa PAO1 His6-tagged RocR expressed in Escherichia coli BL21 (DE3) after 5 mins in presence of [32...
In DepthDetails ArticlePubMed
TargetStimulator of interferon genes protein(Human)
Institute Of Organic Chemistry And Biochemistry Of The Czech Academy Of Sciences And Gilead Sciences Research Centre At Iocb
Curated by ChEMBL
LigandPNGBDBM50436163(CHEMBL1231573)
Affinity DataEC50:  1.10E+3nM. Assay description: Activation of recombinant human STING haplotype G230A/R293Q mutant expressed in 293T cells measured after 30 mins in presence of digitonin A by brigh...
TargetStimulator of interferon genes protein(Human)
Institute Of Organic Chemistry And Biochemistry Of The Czech Academy Of Sciences And Gilead Sciences Research Centre At Iocb
Curated by ChEMBL
LigandPNGBDBM50436163(CHEMBL1231573)
Affinity DataEC50: >4.50E+4nM. Assay description: Activation of recombinant human STING haplotype R293Q mutant expressed in 293T cells measured after 30 mins in presence of digitonin A by bright Glo-...
TargetStimulator of interferon genes protein(Human)
Institute Of Organic Chemistry And Biochemistry Of The Czech Academy Of Sciences And Gilead Sciences Research Centre At Iocb
Curated by ChEMBL
LigandPNGBDBM50436163(CHEMBL1231573)
Affinity DataEC50:  4.50E+3nM. Assay description: Activation of recombinant human wild-type STING expressed in 293T cells measured after 30 mins in presence of digitonin A by bright Glo-luciferase re...
TargetStimulator of interferon genes protein(Human)
Institute Of Organic Chemistry And Biochemistry Of The Czech Academy Of Sciences And Gilead Sciences Research Centre At Iocb
Curated by ChEMBL
LigandPNGBDBM50436163(CHEMBL1231573)
Affinity DataKd:  1.21E+3nM. Assay description: Agonist activity at wild type human STING C-terminal domain (139 to 379 residues) assessed as dissociation constant by isothermal titration calorimet...
TargetStimulator of interferon genes protein(Human)
Institute Of Organic Chemistry And Biochemistry Of The Czech Academy Of Sciences And Gilead Sciences Research Centre At Iocb
Curated by ChEMBL
LigandPNGBDBM50436163(CHEMBL1231573)
Affinity DataEC50:  1.84E+5nM. Assay description: Activation of recombinant human wild-type STING expressed in 293T cells incubated for 7 hrs in absence of digitonin A by bright Glo-luciferase report...
TargetStimulator of interferon genes protein(Human)
Institute Of Organic Chemistry And Biochemistry Of The Czech Academy Of Sciences And Gilead Sciences Research Centre At Iocb
Curated by ChEMBL
LigandPNGBDBM50436163(CHEMBL1231573)
Affinity DataKd:  1.21E+3nM. Assay description: Binding affinity to wild type human STING (139 to 379 residues) by ITC assay
TargetStimulator of interferon genes protein(Human)
Institute Of Organic Chemistry And Biochemistry Of The Czech Academy Of Sciences And Gilead Sciences Research Centre At Iocb
Curated by ChEMBL
LigandPNGBDBM50436163(CHEMBL1231573)
Affinity DataEC50:  4.47E+3nM. Assay description: Activation of wild-type human STING expressed in digitonin treated HEK293T cells co-expressing IRF3-activated ISRE assessed as IRF3 reporter activati...
TargetStimulator of interferon genes protein(Human)
Institute Of Organic Chemistry And Biochemistry Of The Czech Academy Of Sciences And Gilead Sciences Research Centre At Iocb
Curated by ChEMBL
LigandPNGBDBM50436163(CHEMBL1231573)
Affinity DataEC50:  900nM. Assay description: Activation of recombinant human STING haplotype R71H/G230A/R293Q mutant expressed in 293T cells measured after 30 mins in presence of digitonin A by ...