BDBM504391 US11040970, Compound 11-12::US11040970, Compound 11-14
SMILES CCOc1cc2CCN3C[C@@H](CC(C)(C)C)N(C)CC3c2cc1OC
InChI Key InChIKey=YNXYNRFUMLCJMA-PYUWXLGESA-N
Data  2 KI
  Tab Delimited (TSV)   2D SDfile   Computed 3D by Vconf -m prep SDfile
Find this compound or compounds like it in BindingDB:
Activity Spreadsheet -- Enzyme Inhibition Constant Data from BindingDB
Found 2 hits for monomerid = 504391
TargetSynaptic vesicular amine transporter(Homo sapiens (Human))
Neurocrine Biosciences
US Patent
LigandPNGBDBM504391(US11040970, Compound 11-12 | US11040970, Compound ...)
Affinity DataKi: <10nM. Assay description: In a total volume of 0.15 mL in low-binding 96-well plates (Corning #3605), twelve concentrations of test compound were competed against 10 nM 3H-dih...
Ligand InfoPC cidPC sid
In DepthDetails US Patent
TargetSynaptic vesicular amine transporter(Homo sapiens (Human))
Neurocrine Biosciences
US Patent
LigandPNGBDBM504391(US11040970, Compound 11-12 | US11040970, Compound ...)
Affinity DataKi: <10nM. Assay description: In a total volume of 0.15 mL in low-binding 96-well plates (Corning #3605), twelve concentrations of test compound were competed against 10 nM 3H-dih...
Ligand InfoPC cidPC sid
In DepthDetails US Patent