BDBM50440382 CHEMBL2425361
SMILES CCN(CC)CCNc1cccc2C(=O)c3cccc(NCCCCCO)c3C(=O)c12
InChI Key InChIKey=CJZYQLDBZVFPLM-UHFFFAOYSA-N
Data  1 IC50
  Tab Delimited (TSV)   2D SDfile   Computed 3D by Vconf -m prep SDfile
Find this compound or compounds like it in BindingDB:
Activity Spreadsheet -- Enzyme Inhibition Constant Data from BindingDB
Found 1 hit for monomerid = 50440382
TargetTelomerase reverse transcriptase(Homo sapiens (Human))
Universit£
Curated by ChEMBL
LigandPNGBDBM50440382(CHEMBL2425361)
Affinity DataIC50:  1.00E+4nM. Assay description: Inhibition of telomerase (unknown origin) by TRAP assay
In DepthDetails ArticlePubMed