BDBM50440384 CHEMBL2425362
SMILES C[N+](C)(C)CCOc1ccc2c3c(oc2c1)C(=O)c1ccccc1C3=O
InChI Key InChIKey=JPTVXMVUBZXIEM-UHFFFAOYSA-N
Data  1 IC50
  Tab Delimited (TSV)   2D SDfile   Computed 3D by Vconf -m prep SDfile
Find this compound or compounds like it in BindingDB:
Activity Spreadsheet -- Enzyme Inhibition Constant Data from BindingDB
Found 1 hit for monomerid = 50440384
TargetTelomerase reverse transcriptase(Homo sapiens (Human))
Universit£
Curated by ChEMBL
LigandPNGBDBM50440384(CHEMBL2425362)
Affinity DataIC50:  5.40E+3nM. Assay description: Inhibition of telomerase (unknown origin) by TRAP assay
In DepthDetails ArticlePubMed