BDBM50440387 CHEMBL2425365
SMILES Cc1cc(=[N+](C)C)c2cc(NC(=O)c3cccc(n3)C(=O)Nc3ccc4[n+](C)cccc4c3)ccc2n1C
InChI Key InChIKey=LZRNMPNPYZIQAE-UHFFFAOYSA-P
Data  1 IC50
  Tab Delimited (TSV)   2D SDfile   Computed 3D by Vconf -m prep SDfile
Find this compound or compounds like it in BindingDB:
Activity Spreadsheet -- Enzyme Inhibition Constant Data from BindingDB
Found 1 hit for monomerid = 50440387
TargetTelomerase reverse transcriptase(Homo sapiens (Human))
Universit£
Curated by ChEMBL
LigandPNGBDBM50440387(CHEMBL2425365)
Affinity DataIC50:  220nM. Assay description: Inhibition of telomerase (unknown origin) by TRAP assay
In DepthDetails ArticlePubMed