BDBM50440783 CHEMBL2429882
SMILES CN1C[C@](C)(N(CC#Cc2ccc3C[C@]4(Cc3c2)C(=O)Nc2ncccc42)C(=O)C11CCCC1)c1cc(F)cc(F)c1
InChI Key InChIKey=LHTVKUPHWMLAGO-JHOUSYSJSA-N
Data  1 KI
  Tab Delimited (TSV)   2D SDfile   Computed 3D by Vconf -m prep SDfile
Find this compound or compounds like it in BindingDB:
Activity Spreadsheet -- Enzyme Inhibition Constant Data from BindingDB
Found 1 hit for monomerid = 50440783
TargetCalcitonin gene-related peptide type 1 receptor(Homo sapiens (Human))
Merck Research Labortories
Curated by ChEMBL
LigandPNGBDBM50440783(CHEMBL2429882)
Affinity DataKi:  0.110nM. Assay description: Displacement of [125I]-hCGRP from human CGRP receptor expressed in HEK293 cells
In DepthDetails ArticlePubMed