BDBM50441319 CHEMBL2431671
SMILES OP(O)(=O)C(F)(F)c1ccc(cc1)-c1ccccc1C#N
InChI Key InChIKey=OWQNMUFXMYPJRZ-UHFFFAOYSA-N
Data  1 KI
  Tab Delimited (TSV)   2D SDfile   Computed 3D by Vconf -m prep SDfile
Find this compound or compounds like it in BindingDB:
Activity Spreadsheet -- Enzyme Inhibition Constant Data from BindingDB
Found 1 hit for monomerid = 50441319
TargetTyrosine-protein phosphatase non-receptor type 5(Homo sapiens (Human))
Yale University
Curated by ChEMBL
LigandPNGBDBM50441319(CHEMBL2431671)
Affinity DataKi:  3.75E+5nM. Assay description: Inhibition of human STEP using pNPP as substrate after 5 mins by spectrophotometric plate reader analysis
In DepthDetails ArticlePubMed