BDBM50443133 CHEMBL3086174
SMILES CC1(C)CCC(=CC1)c1cc(CCO)ccc1NC(=O)c1ncc([nH]1)C#N
InChI Key InChIKey=JMFAMIHAUCISAL-UHFFFAOYSA-N
Data  2 IC50
  Tab Delimited (TSV)   2D SDfile   Computed 3D by Vconf -m prep SDfile
Find this compound or compounds like it in BindingDB:
Activity Spreadsheet -- Enzyme Inhibition Constant Data from BindingDB
Found 2 hits for monomerid = 50443133
TargetMacrophage colony-stimulating factor 1 receptor(Homo sapiens (Human))
Janssen Research And Development
Curated by ChEMBL
LigandPNGBDBM50443133(CHEMBL3086174)
Affinity DataIC50:  4.60nM. Assay description: Inhibition of FMS (unknown origin)
In DepthDetails ArticlePubMed
TargetMacrophage colony-stimulating factor 1 receptor(Mus musculus (Mouse))
Janssen Research And Development
Curated by ChEMBL
LigandPNGBDBM50443133(CHEMBL3086174)
Affinity DataIC50:  18nM. Assay description: Inhibition of FMS in mouse BMDM cells
In DepthDetails ArticlePubMed