BDBM50443527 CHEMBL1339340::acs.jmedchem.1c00409_ST.358::jm5b01461, Compound 180
SMILES Cc1ccc2nc(sc2c1S(O)(=O)=O)-c1ccc(N)cc1
InChI Key InChIKey=KGZUHYIHYBDNLC-UHFFFAOYSA-N
Data  4 IC50
  Tab Delimited (TSV)   2D SDfile   Computed 3D by Vconf -m prep SDfile
Find this compound or compounds like it in BindingDB:
Activity Spreadsheet -- Enzyme Inhibition Constant Data from BindingDB
Found 4 hits for monomerid = 50443527
Target5'-nucleotidase(Rattus norvegicus (Rat))
Comsats Institute Of Information Technology
Curated by ChEMBL
LigandPNGBDBM50443527(CHEMBL1339340 | acs.jmedchem.1c00409_ST.358 | jm5b...)
Affinity DataIC50:  1.86E+4nM. Assay description: Inhibition of rat recombinant ecto-5'-nucleotidase expressed in african green monkey COS7 cells using adenosine monophosphate as substrate preincubat...
In DepthDetails ArticlePubMed
TargetReplicase polyprotein 1ab(Human SARS coronavirus (SARS-CoV) (Severe acute re...)
Michigan State University
LigandPNGBDBM50443527(CHEMBL1339340 | acs.jmedchem.1c00409_ST.358 | jm5b...)
Affinity DataIC50:  4.30E+3nM. Assay description: This is a review article. Please point to the original journal.
In DepthDetails ArticlePubMed
TargetReplicase polyprotein 1ab(Human SARS coronavirus (SARS-CoV) (Severe acute re...)
Michigan State University
LigandPNGBDBM50443527(CHEMBL1339340 | acs.jmedchem.1c00409_ST.358 | jm5b...)
Affinity DataIC50:  4.30E+3nM. Assay description: This is a review article.
In DepthDetails ArticlePubMed
Target5'-nucleotidase(Homo sapiens (Human))
Comsats Institute Of Information Technology
Curated by ChEMBL
LigandPNGBDBM50443527(CHEMBL1339340 | acs.jmedchem.1c00409_ST.358 | jm5b...)
Affinity DataIC50:  1.35E+4nM. Assay description: Inhibition of human recombinant ecto-5'-nucleotidase expressed in african green monkey COS7 cells using adenosine monophosphate as substrate preincub...
In DepthDetails ArticlePubMed