BDBM504437 4-((1r,4r)-4-(4-(2-((2-(2,6- dioxopiperidin-3-yl)-1,3- dioxoisoindolin-5- yl)oxy)ethyl)piperazin-1- yl)cyclohexyl)amino) quinazoline-6-carbonitrile::US11065231, Example 29
SMILES O=C1N(C2CCC(=O)NC2=O)C(=O)c2cc(OCCN3CCN(CC3)[C@H]3CC[C@@H](CC3)Nc3ncnc4ccc(cc34)C#N)ccc12
InChI Key InChIKey=NCGQKEMZIMGNPS-RZWCHVLBSA-N
Data  1 IC50
  Tab Delimited (TSV)   2D SDfile   Computed 3D by Vconf -m prep SDfile
Find this compound or compounds like it in BindingDB:
Activity Spreadsheet -- Enzyme Inhibition Constant Data from BindingDB
Found 1 hit for monomerid = 504437
TargetInterleukin-1 receptor-associated kinase 4(Homo sapiens (Human))
Arvinas Operations
US Patent
LigandPNGBDBM504437(4-((1r,4r)-4-(4-(2-((2-(2,6- dioxopiperidin-3-yl)-...)
Affinity DataIC50:  650nM. Assay description: A Z′-Lyte assay based on a fluorescence resonance energy transfer (FRET) readout was developed for measuring IRAK4-dependent phosphorylation of...
Ligand InfoPC cidPC sid
In DepthDetails US Patent