BDBM50445803 CHEMBL3104775
SMILES CC(C)(C(=O)N[C@H](C(=O)NCCN)c1ccccc1)c1cc(cc(c1)C(F)(F)F)C(F)(F)F
InChI Key InChIKey=HHRSDRPDFNUAPK-KRWDZBQOSA-N
Data  2 KI
  Tab Delimited (TSV)   2D SDfile   Computed 3D by Vconf -m prep SDfile
Find this compound or compounds like it in BindingDB:
Activity Spreadsheet -- Enzyme Inhibition Constant Data from BindingDB
Found 2 hits for monomerid = 50445803
TargetSubstance-P receptor(Homo sapiens (Human))
Universit£
Curated by ChEMBL
LigandPNGBDBM50445803(CHEMBL3104775)
Affinity DataKi:  316nM. Assay description: Displacement of [125I]-Bolton Hunter-Substance P from human NK1 receptor
In DepthDetails ArticlePubMed
TargetNeuromedin-K receptor(Homo sapiens (Human))
Universit£
Curated by ChEMBL
LigandPNGBDBM50445803(CHEMBL3104775)
Affinity DataKi:  1.00E+4nM. Assay description: Displacement of [3H]-SR142801 from human NK3 receptor
In DepthDetails ArticlePubMed