BDBM50445813 CHEMBL3104771
SMILES Cc1cc(C)cc(c1)C(C)(C)C(=O)N[C@H](C(=O)NCCN1CCOCC1)c1ccccc1
InChI Key InChIKey=BKDQVYDRBXSHIN-QHCPKHFHSA-N
Data  2 KI
  Tab Delimited (TSV)   2D SDfile   Computed 3D by Vconf -m prep SDfile
Find this compound or compounds like it in BindingDB:
Activity Spreadsheet -- Enzyme Inhibition Constant Data from BindingDB
Found 2 hits for monomerid = 50445813
TargetNeuromedin-K receptor(Homo sapiens (Human))
Universit£
Curated by ChEMBL
LigandPNGBDBM50445813(CHEMBL3104771)
Affinity DataKi: >1.00E+4nM. Assay description: Displacement of [3H]-SR142801 from human NK3 receptor
In DepthDetails ArticlePubMed
TargetSubstance-P receptor(Homo sapiens (Human))
Universit£
Curated by ChEMBL
LigandPNGBDBM50445813(CHEMBL3104771)
Affinity DataKi: >1.00E+4nM. Assay description: Displacement of [125I]-Bolton Hunter-Substance P from human NK1 receptor
In DepthDetails ArticlePubMed