BDBM50446336 CHEMBL3109586
SMILES C[C@H]1OC(=O)[C@@H]2C[C@@H]3C[C@H](CNC(=O)[C@@H]4CCCN4)CC[C@H]3[C@H](\C=C\c3ccc(cn3)-c3cccc(F)c3)[C@H]12
InChI Key InChIKey=IIUQSYFAAKGJSX-OTCLARJFSA-N
Data  1 KI
  Tab Delimited (TSV)   2D SDfile   Computed 3D by Vconf -m prep SDfile
Find this compound or compounds like it in BindingDB:
Activity Spreadsheet -- Enzyme Inhibition Constant Data from BindingDB
Found 1 hit for monomerid = 50446336
TargetProteinase-activated receptor 1(Homo sapiens (Human))
Merck Research Laboratories
Curated by ChEMBL
LigandPNGBDBM50446336(CHEMBL3109586)
Affinity DataKi:  24nM. Assay description: Displacement of [3H]haTRAP from PAR-1 isolated from human platelets by liquid scintillation counting analysis
In DepthDetails ArticlePubMed