BDBM50446392 CHEMBL3109645::US9181261, 2
SMILES CC(C)N(Cc1c[nH]c2ncccc12)C(=O)Nc1ccc(OC(F)(F)F)cc1
InChI Key InChIKey=GKLLTYZVZSJZPP-UHFFFAOYSA-N
Data  2 IC50  2 EC50
  Tab Delimited (TSV)   2D SDfile   Computed 3D by Vconf -m prep SDfile
Find this compound or compounds like it in BindingDB:
Activity Spreadsheet -- Enzyme Inhibition Constant Data from BindingDB
Found 4 hits for monomerid = 50446392
TargetHigh affinity nerve growth factor receptor(Homo sapiens (Human))
Merck Sharp & Dohme
US Patent
LigandPNGBDBM50446392(CHEMBL3109645 | US9181261, 2)
Affinity DataEC50:  11.3nMT: 2°C. Assay description: TrkA kinase activity was measured as the ability of the enzyme to phosphorylate a fluorescently labeled peptide substrate. Buffer salts, reagents, an...
In DepthDetails US Patent
TargetHigh affinity nerve growth factor receptor(Homo sapiens (Human))
Merck Sharp & Dohme
US Patent
LigandPNGBDBM50446392(CHEMBL3109645 | US9181261, 2)
Affinity DataEC50:  11nM. Assay description: Inhibition of TrkA (unknown origin) using fluorescently labeled peptide substrate after 3 hrs
In DepthDetails ArticlePubMed
TargetHigh affinity nerve growth factor receptor(Homo sapiens (Human))
Merck Sharp & Dohme
US Patent
LigandPNGBDBM50446392(CHEMBL3109645 | US9181261, 2)
Affinity DataIC50:  3nM. Assay description: Inhibition of human TrkA expressed in human U2OS cells assessed as inhibition of NGF-induced maximum response after 1 hr by beta-galactosidase assay
In DepthDetails ArticlePubMed
TargetHigh affinity nerve growth factor receptor(Homo sapiens (Human))
Merck Sharp & Dohme
US Patent
LigandPNGBDBM50446392(CHEMBL3109645 | US9181261, 2)
Affinity DataIC50:  11nM. Assay description: Inhibition of phsophorylated TrkA (unknown origin) assessed as inhibition of fluorescently-labelled substrate phosphorylation by CALIPER enzymatic as...
In DepthDetails ArticlePubMed