BDBM50446685 CHEMBL3113613
SMILES COC(=O)[C@@H](Cc1c[nH]c2ccccc12)NC(=O)C(=O)c1cn(c2ccccc12)S(=O)(=O)c1ccc(C)cc1
InChI Key InChIKey=VGSKHFCMGREMKD-RUZDIDTESA-N
Data  1 KI  2 IC50
  Tab Delimited (TSV)   2D SDfile   Computed 3D by Vconf -m prep SDfile
Find this compound or compounds like it in BindingDB:
Activity Spreadsheet -- Enzyme Inhibition Constant Data from BindingDB
Found 3 hits for monomerid = 50446685
TargetPolyunsaturated fatty acid 5-lipoxygenase(Homo sapiens (Human))
Guru Nanak Dev University
Curated by ChEMBL
LigandPNGBDBM50446685(CHEMBL3113613)
Affinity DataKi:  37nM. Assay description: Inhibition of 5-LOX (unknown origin) by UV-Vis spectrophotometry
In DepthDetails ArticlePubMed
TargetPolyunsaturated fatty acid 5-lipoxygenase(Homo sapiens (Human))
Guru Nanak Dev University
Curated by ChEMBL
LigandPNGBDBM50446685(CHEMBL3113613)
Affinity DataIC50:  52nM. Assay description: Inhibition of 5-LOX (unknown origin) using arachidonic acid as substrate after 5 mins by EIA
In DepthDetails ArticlePubMed
TargetPolyunsaturated fatty acid 5-lipoxygenase(Homo sapiens (Human))
Guru Nanak Dev University
Curated by ChEMBL
LigandPNGBDBM50446685(CHEMBL3113613)
Affinity DataIC50:  14nM. Assay description: Inhibition of 5-LOX (unknown origin) using arachidonic acid as substrate after 5 mins by EIA in presence of pig liver esterase
In DepthDetails ArticlePubMed